{"text_format":"3","workbook":"xlsx","n_sheets":5,"sheets":["Istruzioni","Input","Scenari","Dashboard","Piano mensile"],"not_rendered":{"comments":1},"read":"whole","date_system":"1900"}

{"sheet":"Istruzioni","index":0,"n_rows":24,"n_cols":2,"rows_kept":24,"merged":[[0,0,0,7],[10,0,10,4],[18,0,18,4]]}
["Simulatore Vendita Cantiere Freesbe"]
[]
["Come usare questo file"]
["1. Compila solo le celle blu nel foglio Input."]
["2. Inserisci le metriche reali del funnel: lead → appuntamento, appuntamento → proposta, proposta → vendita."]
["3. Compila capacità team, quota lead organici/referral e buffer strategici."]
["4. Il foglio Scenari confronta tre ipotesi: Prudente, Realistico, Aggressivo."]
["5. Il foglio Dashboard evidenzia sostenibilità, gap budget, capacità e collo di bottiglia."]
["6. Il foglio Piano mensile traduce lo scenario in target operativi per mese."]
[]
["Logica del modello"]
["• Lead necessari con buffer = Lead necessari × (1 + buffer lead)"]
["• Lead paid necessari = Lead necessari con buffer × (1 - quota lead organici/referral)"]
["• Budget totale con buffer = Lead paid necessari × CPL × (1 + buffer budget)"]
["• Mesi stimati = Unità da vendere / vendite mensili sostenibili con il budget attuale"]
{"$rows_left_out":10}
{"sheet":"Input","index":1,"n_rows":30,"n_cols":4,"rows_kept":30,"merged":[[0,0,0,4],[3,0,3,2],[12,0,12,2],[18,0,18,3],[24,0,24,3]]}
["Input del progetto"]
["Compila solo le celle blu"]
[]
["Anagrafica progetto"]
["Nome progetto","Residenze Aurora"]
["Area / città","Milano"]
["Tipologia progetto","Nuova costruzione"]
["Unità da vendere",24]
["Prezzo medio per unità (€)",420000]
["Obiettivo di sell-out (mesi)",12]
["Budget marketing mensile disponibile (€)",6500]
[]
["Assunzioni funnel commerciale"]
["Lead → appuntamento",{"v":0.12,"d":"12.0%"}]
["Appuntamento → proposta",{"v":0.35,"d":"35.0%"}]
{"$rows_left_out":16}
{"sheet":"Scenari","index":2,"n_rows":58,"n_cols":4,"rows_kept":58,"merged":[[0,0,0,3],[34,0,34,3]]}
["Confronto scenari"]
["Il foglio confronta il progetto in tre letture diverse"]
[null,"Prudente","Realistico","Aggressivo"]
["Fattore conversioni",{"$f":"Input!$B$21","v":{"v":0.85,"d":"85.0%"}},{"$f":"Input!$B$22","v":{"v":1,"d":"100.0%"}},{"$f":"Input!$B$23","v":{"v":1.15,"d":"115.0%"}}]
["Fattore CPL",{"$f":"Input!$C$21","v":{"v":1.15,"d":"115.0%"}},{"$f":"Input!$C$22","v":{"v":1,"d":"100.0%"}},{"$f":"Input!$C$23","v":{"v":0.9,"d":"90.0%"}}]
[]
["Lead → appuntamento effettivo",{"$f":"Input!$B$14*B4","v":{"v":0.102,"d":"10.2%"}},{"$f":"Input!$B$14*C4","v":{"v":0.12,"d":"12.0%"}},{"$f":"Input!$B$14*D4","v":{"v":0.13799999999999998,"d":"13.8%"}}]
["Appuntamento → proposta effettivo",{"$f":"Input!$B$15*B4","v":{"v":0.2975,"d":"29.8%"}},{"$f":"Input!$B$15*C4","v":{"v":0.35,"d":"35.0%"}},{"$f":"Input!$B$15*D4","v":{"v":0.40249999999999997,"d":"40.3%"}}]
["Proposta → vendita effettivo",{"$f":"Input!$B$16*B4","v":{"v":0.23800000000000002,"d":"23.8%"}},{"$f":"Input!$B$16*C4","v":{"v":0.28,"d":"28.0%"}},{"$f":"Input!$B$16*D4","v":{"v":0.322,"d":"32.2%"}}]
["Conversione complessiva",{"$f":"B7*B8*B9","v":{"v":0.0072221099999999995,"d":"0.72%"}},{"$f":"C7*C8*C9","v":{"v":0.01176,"d":"1.18%"}},{"$f":"D7*D8*D9","v":{"v":0.017885489999999997,"d":"1.79%"}}]
["CPL effettivo (€)",{"$f":"Input!$B$17*B5","v":43.699999999999996},{"$f":"Input!$B$17*C5","v":38},{"$f":"Input!$B$17*D5","v":34.2}]
[]
["Unità da vendere",{"$f":"Input!$B$8","v":24},{"$f":"Input!$B$8","v":24},{"$f":"Input!$B$8","v":24}]
["Prezzo medio per unità (€)",{"$f":"Input!$B$9","v":420000},{"$f":"Input!$B$9","v":420000},{"$f":"Input!$B$9","v":420000}]
["Obiettivo di sell-out (mesi)",{"$f":"Input!$B$10","v":12},{"$f":"Input!$B$10","v":12},{"$f":"Input!$B$10","v":12}]
{"$rows_left_out":44}
{"sheet":"Dashboard","index":3,"n_rows":31,"n_cols":9,"rows_kept":31,"merged":[[0,0,0,8],[13,5,13,6],[14,5,14,6],[15,5,15,6],[30,1,32,8]]}
["Dashboard sintetica"]
[null,"Seleziona scenario","Realistico"]
[]
[null,"Progetto",{"$f":"Input!B5","v":"Residenze Aurora"},null,"Area",{"$f":"Input!B6","v":"Milano"},null,"Tipologia",{"$f":"Input!B7","v":"Nuova costruzione"}]
[]
[null,"Unità da vendere",null,null,"Lead necessari (buffer)",null,null,"Budget totale con buffer"]
[null,{"$f":"INDEX(Scenari!$B$13:$D$13,1,MATCH($C$2,Scenari!$B$3:$D$3,0))","v":24},null,null,{"$f":"INDEX(Scenari!$B$42:$D$42,1,MATCH($C$2,Scenari!$B$3:$D$3,0))","v":{"v":2244.8979591836737,"d":"2244.9"}},null,null,{"$f":"INDEX(Scenari!$B$46:$D$46,1,MATCH($C$2,Scenari!$B$3:$D$3,0))","v":79761.22448979593}]
[]
[]
[null,"Appuntamenti / mese",null,null,"Proposte / mese",null,null,"Mesi stimati"]
[null,{"$f":"INDEX(Scenari!$B$44:$D$44,1,MATCH($C$2,Scenari!$B$3:$D$3,0))","v":{"v":20.408163265306122,"d":"20.4"}},null,null,{"$f":"INDEX(Scenari!$B$45:$D$45,1,MATCH($C$2,Scenari!$B$3:$D$3,0))","v":{"v":7.142857142857142,"d":"7.1"}},null,null,{"$f":"INDEX(Scenari!$B$51:$D$51,1,MATCH($C$2,Scenari!$B$3:$D$3,0))","v":{"v":10.141287284144429,"d":"10.1"}}]
[]
[]
[null,"Budget mensile attuale",{"$f":"INDEX(Scenari!$B$16:$D$16,1,MATCH($C$2,Scenari!$B$3:$D$3,0))","v":6500},null,"Stato operativo",{"$f":"INDEX(Scenari!$B$58:$D$58,1,MATCH($C$2,Scenari!$B$3:$D$3,0))","v":"Target raggiungibile ma team da potenziare"},null,"Max appunt./mese",{"$f":"INDEX(Scenari!$B$39:$D$39,1,MATCH($C$2,Scenari!$B$3:$D$3,0))","v":18}]
[null,"Gap budget / mese",{"$f":"INDEX(Scenari!$B$52:$D$52,1,MATCH($C$2,Scenari!$B$3:$D$3,0))","v":146.7687074829946},null,"Collo di bottiglia",{"$f":"INDEX(Scenari!$B$56:$D$56,1,MATCH($C$2,Scenari!$B$3:$D$3,0))","v":"Lead → appuntamento"},null,"Gap appunt./mese",{"$f":"INDEX(Scenari!$B$53:$D$53,1,MATCH($C$2,Scenari!$B$3:$D$3,0))","v":{"v":2.408163265306122,"d":"2.4"}}]
{"$rows_left_out":17}
{"sheet":"Piano mensile","index":4,"n_rows":34,"n_cols":9,"rows_kept":34,"merged":[[0,0,0,8],[3,0,3,8],[32,7,32,8],[33,7,33,8]]}
["Piano mensile operativo"]
["Scenario attivo",{"$f":"Dashboard!C2","v":"Realistico"},null,"Progetto",{"$f":"Input!B5","v":"Residenze Aurora"}]
[]
["Distribuzione lineare di base: usa questo foglio per tradurre lo scenario in target operativi mensili e verificare subito budget e capacità."]
[]
["Mese","Vendite target","Vendite cumulative","Lead totali","Lead paid","Appuntamenti","Proposte","Budget richiesto","Verifica operativa"]
[1,{"$f":"IF($A7<=INDEX(Scenari!$B$15:$D$15,1,MATCH($B$2,Scenari!$B$3:$D$3,0)),INDEX(Scenari!$B$13:$D$13,1,MATCH($B$2,Scenari!$B$3:$D$3,0))/INDEX(Scenari!$B$15:$D$15,1,MATCH($B$2,Scenari!$B$3:$D$3,0)),\"\")","v":{"v":2,"d":"2.0"}},{"$f":"IF(B7=\"\",\"\",SUM($B$7:B7))","v":{"v":2,"d":"2.0"}},{"$f":"IF($A7<=INDEX(Scenari!$B$15:$D$15,1,MATCH($B$2,Scenari!$B$3:$D$3,0)),INDEX(Scenari!$B$42:$D$42,1,MATCH($B$2,Scenari!$B$3:$D$3,0))/INDEX(Scenari!$B$15:$D$15,1,MATCH($B$2,Scenari!$B$3:$D$3,0)),\"\")","v":{"v":187.0748299319728,"d":"187.1"}},{"$f":"IF($A7<=INDEX(Scenari!$B$15:$D$15,1,MATCH($B$2,Scenari!$B$3:$D$3,0)),INDEX(Scenari!$B$43:$D$43,1,MATCH($B$2,Scenari!$B$3:$D$3,0))/INDEX(Scenari!$B$15:$D$15,1,MATCH($B$2,Scenari!$B$3:$D$3,0)),\"\")","v":{"v":159.0136054421769,"d":"159.0"}},{"$f":"IF($A7<=INDEX(Scenari!$B$15:$D$15,1,MATCH($B$2,Scenari!$B$3:$D$3,0)),INDEX(Scenari!$B$19:$D$19,1,MATCH($B$2,Scenari!$B$3:$D$3,0))/INDEX(Scenari!$B$15:$D$15,1,MATCH($B$2,Scenari!$B$3:$D$3,0)),\"\")","v":{"v":20.408163265306122,"d":"20.4"}},{"$f":"IF($A7<=INDEX(Scenari!$B$15:$D$15,1,MATCH($B$2,Scenari!$B$3:$D$3,0)),INDEX(Scenari!$B$20:$D$20,1,MATCH($B$2,Scenari!$B$3:$D$3,0))/INDEX(Scenari!$B$15:$D$15,1,MATCH($B$2,Scenari!$B$3:$D$3,0)),\"\")","v":{"v":7.142857142857142,"d":"7.1"}},{"$f":"IF($A7<=INDEX(Scenari!$B$15:$D$15,1,MATCH($B$2,Scenari!$B$3:$D$3,0)),INDEX(Scenari!$B$47:$D$47,1,MATCH($B$2,Scenari!$B$3:$D$3,0)),\"\")","v":6646.768707482995},{"$f":"IF(B7=\"\",\"\",IF(INDEX(Scenari!$B$19:$D$19,1,MATCH($B$2,Scenari!$B$3:$D$3,0))/INDEX(Scenari!$B$15:$D$15,1,MATCH($B$2,Scenari!$B$3:$D$3,0))>INDEX(Scenari!$B$39:$D$39,1,MATCH($B$2,Scenari!$B$3:$D$3,0)),\"Rafforzare appuntamenti\",IF(INDEX(Scenari!$B$20:$D$20,1,MATCH($B$2,Scenari!$B$3:$D$3,0))/INDEX(Scenari!$B$15:$D$15,1,MATCH($B$2,Scenari!$B$3:$D$3,0))>INDEX(Scenari!$B$40:$D$40,1,MATCH($B$2,Scenari!$B$3:$D$3,0)),\"Rafforzare proposte\",IF(INDEX(Scenari!$B$47:$D$47,1,MATCH($B$2,Scenari!$B$3:$D$3,0))>INDEX(Scenari!$B$16:$D$16,1,MATCH($B$2,Scenari!$B$3:$D$3,0)),\"Rafforzare budget / CPL\",\"In linea\"))))","v":"Rafforzare appuntamenti"}]
[2,{"$f":"IF($A8<=INDEX(Scenari!$B$15:$D$15,1,MATCH($B$2,Scenari!$B$3:$D$3,0)),INDEX(Scenari!$B$13:$D$13,1,MATCH($B$2,Scenari!$B$3:$D$3,0))/INDEX(Scenari!$B$15:$D$15,1,MATCH($B$2,Scenari!$B$3:$D$3,0)),\"\")","v":{"v":2,"d":"2.0"}},{"$f":"IF(B8=\"\",\"\",SUM($B$7:B8))","v":{"v":4,"d":"4.0"}},{"$f":"IF($A8<=INDEX(Scenari!$B$15:$D$15,1,MATCH($B$2,Scenari!$B$3:$D$3,0)),INDEX(Scenari!$B$42:$D$42,1,MATCH($B$2,Scenari!$B$3:$D$3,0))/INDEX(Scenari!$B$15:$D$15,1,MATCH($B$2,Scenari!$B$3:$D$3,0)),\"\")","v":{"v":187.0748299319728,"d":"187.1"}},{"$f":"IF($A8<=INDEX(Scenari!$B$15:$D$15,1,MATCH($B$2,Scenari!$B$3:$D$3,0)),INDEX(Scenari!$B$43:$D$43,1,MATCH($B$2,Scenari!$B$3:$D$3,0))/INDEX(Scenari!$B$15:$D$15,1,MATCH($B$2,Scenari!$B$3:$D$3,0)),\"\")","v":{"v":159.0136054421769,"d":"159.0"}},{"$f":"IF($A8<=INDEX(Scenari!$B$15:$D$15,1,MATCH($B$2,Scenari!$B$3:$D$3,0)),INDEX(Scenari!$B$19:$D$19,1,MATCH($B$2,Scenari!$B$3:$D$3,0))/INDEX(Scenari!$B$15:$D$15,1,MATCH($B$2,Scenari!$B$3:$D$3,0)),\"\")","v":{"v":20.408163265306122,"d":"20.4"}},{"$f":"IF($A8<=INDEX(Scenari!$B$15:$D$15,1,MATCH($B$2,Scenari!$B$3:$D$3,0)),INDEX(Scenari!$B$20:$D$20,1,MATCH($B$2,Scenari!$B$3:$D$3,0))/INDEX(Scenari!$B$15:$D$15,1,MATCH($B$2,Scenari!$B$3:$D$3,0)),\"\")","v":{"v":7.142857142857142,"d":"7.1"}},{"$f":"IF($A8<=INDEX(Scenari!$B$15:$D$15,1,MATCH($B$2,Scenari!$B$3:$D$3,0)),INDEX(Scenari!$B$47:$D$47,1,MATCH($B$2,Scenari!$B$3:$D$3,0)),\"\")","v":6646.768707482995},{"$f":"IF(B8=\"\",\"\",IF(INDEX(Scenari!$B$19:$D$19,1,MATCH($B$2,Scenari!$B$3:$D$3,0))/INDEX(Scenari!$B$15:$D$15,1,MATCH($B$2,Scenari!$B$3:$D$3,0))>INDEX(Scenari!$B$39:$D$39,1,MATCH($B$2,Scenari!$B$3:$D$3,0)),\"Rafforzare appuntamenti\",IF(INDEX(Scenari!$B$20:$D$20,1,MATCH($B$2,Scenari!$B$3:$D$3,0))/INDEX(Scenari!$B$15:$D$15,1,MATCH($B$2,Scenari!$B$3:$D$3,0))>INDEX(Scenari!$B$40:$D$40,1,MATCH($B$2,Scenari!$B$3:$D$3,0)),\"Rafforzare proposte\",IF(INDEX(Scenari!$B$47:$D$47,1,MATCH($B$2,Scenari!$B$3:$D$3,0))>INDEX(Scenari!$B$16:$D$16,1,MATCH($B$2,Scenari!$B$3:$D$3,0)),\"Rafforzare budget / CPL\",\"In linea\"))))","v":"Rafforzare appuntamenti"}]
[3,{"$f":"IF($A9<=INDEX(Scenari!$B$15:$D$15,1,MATCH($B$2,Scenari!$B$3:$D$3,0)),INDEX(Scenari!$B$13:$D$13,1,MATCH($B$2,Scenari!$B$3:$D$3,0))/INDEX(Scenari!$B$15:$D$15,1,MATCH($B$2,Scenari!$B$3:$D$3,0)),\"\")","v":{"v":2,"d":"2.0"}},{"$f":"IF(B9=\"\",\"\",SUM($B$7:B9))","v":{"v":6,"d":"6.0"}},{"$f":"IF($A9<=INDEX(Scenari!$B$15:$D$15,1,MATCH($B$2,Scenari!$B$3:$D$3,0)),INDEX(Scenari!$B$42:$D$42,1,MATCH($B$2,Scenari!$B$3:$D$3,0))/INDEX(Scenari!$B$15:$D$15,1,MATCH($B$2,Scenari!$B$3:$D$3,0)),\"\")","v":{"v":187.0748299319728,"d":"187.1"}},{"$f":"IF($A9<=INDEX(Scenari!$B$15:$D$15,1,MATCH($B$2,Scenari!$B$3:$D$3,0)),INDEX(Scenari!$B$43:$D$43,1,MATCH($B$2,Scenari!$B$3:$D$3,0))/INDEX(Scenari!$B$15:$D$15,1,MATCH($B$2,Scenari!$B$3:$D$3,0)),\"\")","v":{"v":159.0136054421769,"d":"159.0"}},{"$f":"IF($A9<=INDEX(Scenari!$B$15:$D$15,1,MATCH($B$2,Scenari!$B$3:$D$3,0)),INDEX(Scenari!$B$19:$D$19,1,MATCH($B$2,Scenari!$B$3:$D$3,0))/INDEX(Scenari!$B$15:$D$15,1,MATCH($B$2,Scenari!$B$3:$D$3,0)),\"\")","v":{"v":20.408163265306122,"d":"20.4"}},{"$f":"IF($A9<=INDEX(Scenari!$B$15:$D$15,1,MATCH($B$2,Scenari!$B$3:$D$3,0)),INDEX(Scenari!$B$20:$D$20,1,MATCH($B$2,Scenari!$B$3:$D$3,0))/INDEX(Scenari!$B$15:$D$15,1,MATCH($B$2,Scenari!$B$3:$D$3,0)),\"\")","v":{"v":7.142857142857142,"d":"7.1"}},{"$f":"IF($A9<=INDEX(Scenari!$B$15:$D$15,1,MATCH($B$2,Scenari!$B$3:$D$3,0)),INDEX(Scenari!$B$47:$D$47,1,MATCH($B$2,Scenari!$B$3:$D$3,0)),\"\")","v":6646.768707482995},{"$f":"IF(B9=\"\",\"\",IF(INDEX(Scenari!$B$19:$D$19,1,MATCH($B$2,Scenari!$B$3:$D$3,0))/INDEX(Scenari!$B$15:$D$15,1,MATCH($B$2,Scenari!$B$3:$D$3,0))>INDEX(Scenari!$B$39:$D$39,1,MATCH($B$2,Scenari!$B$3:$D$3,0)),\"Rafforzare appuntamenti\",IF(INDEX(Scenari!$B$20:$D$20,1,MATCH($B$2,Scenari!$B$3:$D$3,0))/INDEX(Scenari!$B$15:$D$15,1,MATCH($B$2,Scenari!$B$3:$D$3,0))>INDEX(Scenari!$B$40:$D$40,1,MATCH($B$2,Scenari!$B$3:$D$3,0)),\"Rafforzare proposte\",IF(INDEX(Scenari!$B$47:$D$47,1,MATCH($B$2,Scenari!$B$3:$D$3,0))>INDEX(Scenari!$B$16:$D$16,1,MATCH($B$2,Scenari!$B$3:$D$3,0)),\"Rafforzare budget / CPL\",\"In linea\"))))","v":"Rafforzare appuntamenti"}]
[4,{"$f":"IF($A10<=INDEX(Scenari!$B$15:$D$15,1,MATCH($B$2,Scenari!$B$3:$D$3,0)),INDEX(Scenari!$B$13:$D$13,1,MATCH($B$2,Scenari!$B$3:$D$3,0))/INDEX(Scenari!$B$15:$D$15,1,MATCH($B$2,Scenari!$B$3:$D$3,0)),\"\")","v":{"v":2,"d":"2.0"}},{"$f":"IF(B10=\"\",\"\",SUM($B$7:B10))","v":{"v":8,"d":"8.0"}},{"$f":"IF($A10<=INDEX(Scenari!$B$15:$D$15,1,MATCH($B$2,Scenari!$B$3:$D$3,0)),INDEX(Scenari!$B$42:$D$42,1,MATCH($B$2,Scenari!$B$3:$D$3,0))/INDEX(Scenari!$B$15:$D$15,1,MATCH($B$2,Scenari!$B$3:$D$3,0)),\"\")","v":{"v":187.0748299319728,"d":"187.1"}},{"$f":"IF($A10<=INDEX(Scenari!$B$15:$D$15,1,MATCH($B$2,Scenari!$B$3:$D$3,0)),INDEX(Scenari!$B$43:$D$43,1,MATCH($B$2,Scenari!$B$3:$D$3,0))/INDEX(Scenari!$B$15:$D$15,1,MATCH($B$2,Scenari!$B$3:$D$3,0)),\"\")","v":{"v":159.0136054421769,"d":"159.0"}},{"$f":"IF($A10<=INDEX(Scenari!$B$15:$D$15,1,MATCH($B$2,Scenari!$B$3:$D$3,0)),INDEX(Scenari!$B$19:$D$19,1,MATCH($B$2,Scenari!$B$3:$D$3,0))/INDEX(Scenari!$B$15:$D$15,1,MATCH($B$2,Scenari!$B$3:$D$3,0)),\"\")","v":{"v":20.408163265306122,"d":"20.4"}},{"$f":"IF($A10<=INDEX(Scenari!$B$15:$D$15,1,MATCH($B$2,Scenari!$B$3:$D$3,0)),INDEX(Scenari!$B$20:$D$20,1,MATCH($B$2,Scenari!$B$3:$D$3,0))/INDEX(Scenari!$B$15:$D$15,1,MATCH($B$2,Scenari!$B$3:$D$3,0)),\"\")","v":{"v":7.142857142857142,"d":"7.1"}},{"$f":"IF($A10<=INDEX(Scenari!$B$15:$D$15,1,MATCH($B$2,Scenari!$B$3:$D$3,0)),INDEX(Scenari!$B$47:$D$47,1,MATCH($B$2,Scenari!$B$3:$D$3,0)),\"\")","v":6646.768707482995},{"$f":"IF(B10=\"\",\"\",IF(INDEX(Scenari!$B$19:$D$19,1,MATCH($B$2,Scenari!$B$3:$D$3,0))/INDEX(Scenari!$B$15:$D$15,1,MATCH($B$2,Scenari!$B$3:$D$3,0))>INDEX(Scenari!$B$39:$D$39,1,MATCH($B$2,Scenari!$B$3:$D$3,0)),\"Rafforzare appuntamenti\",IF(INDEX(Scenari!$B$20:$D$20,1,MATCH($B$2,Scenari!$B$3:$D$3,0))/INDEX(Scenari!$B$15:$D$15,1,MATCH($B$2,Scenari!$B$3:$D$3,0))>INDEX(Scenari!$B$40:$D$40,1,MATCH($B$2,Scenari!$B$3:$D$3,0)),\"Rafforzare proposte\",IF(INDEX(Scenari!$B$47:$D$47,1,MATCH($B$2,Scenari!$B$3:$D$3,0))>INDEX(Scenari!$B$16:$D$16,1,MATCH($B$2,Scenari!$B$3:$D$3,0)),\"Rafforzare budget / CPL\",\"In linea\"))))","v":"Rafforzare appuntamenti"}]
[5,{"$f":"IF($A11<=INDEX(Scenari!$B$15:$D$15,1,MATCH($B$2,Scenari!$B$3:$D$3,0)),INDEX(Scenari!$B$13:$D$13,1,MATCH($B$2,Scenari!$B$3:$D$3,0))/INDEX(Scenari!$B$15:$D$15,1,MATCH($B$2,Scenari!$B$3:$D$3,0)),\"\")","v":{"v":2,"d":"2.0"}},{"$f":"IF(B11=\"\",\"\",SUM($B$7:B11))","v":{"v":10,"d":"10.0"}},{"$f":"IF($A11<=INDEX(Scenari!$B$15:$D$15,1,MATCH($B$2,Scenari!$B$3:$D$3,0)),INDEX(Scenari!$B$42:$D$42,1,MATCH($B$2,Scenari!$B$3:$D$3,0))/INDEX(Scenari!$B$15:$D$15,1,MATCH($B$2,Scenari!$B$3:$D$3,0)),\"\")","v":{"v":187.0748299319728,"d":"187.1"}},{"$f":"IF($A11<=INDEX(Scenari!$B$15:$D$15,1,MATCH($B$2,Scenari!$B$3:$D$3,0)),INDEX(Scenari!$B$43:$D$43,1,MATCH($B$2,Scenari!$B$3:$D$3,0))/INDEX(Scenari!$B$15:$D$15,1,MATCH($B$2,Scenari!$B$3:$D$3,0)),\"\")","v":{"v":159.0136054421769,"d":"159.0"}},{"$f":"IF($A11<=INDEX(Scenari!$B$15:$D$15,1,MATCH($B$2,Scenari!$B$3:$D$3,0)),INDEX(Scenari!$B$19:$D$19,1,MATCH($B$2,Scenari!$B$3:$D$3,0))/INDEX(Scenari!$B$15:$D$15,1,MATCH($B$2,Scenari!$B$3:$D$3,0)),\"\")","v":{"v":20.408163265306122,"d":"20.4"}},{"$f":"IF($A11<=INDEX(Scenari!$B$15:$D$15,1,MATCH($B$2,Scenari!$B$3:$D$3,0)),INDEX(Scenari!$B$20:$D$20,1,MATCH($B$2,Scenari!$B$3:$D$3,0))/INDEX(Scenari!$B$15:$D$15,1,MATCH($B$2,Scenari!$B$3:$D$3,0)),\"\")","v":{"v":7.142857142857142,"d":"7.1"}},{"$f":"IF($A11<=INDEX(Scenari!$B$15:$D$15,1,MATCH($B$2,Scenari!$B$3:$D$3,0)),INDEX(Scenari!$B$47:$D$47,1,MATCH($B$2,Scenari!$B$3:$D$3,0)),\"\")","v":6646.768707482995},{"$f":"IF(B11=\"\",\"\",IF(INDEX(Scenari!$B$19:$D$19,1,MATCH($B$2,Scenari!$B$3:$D$3,0))/INDEX(Scenari!$B$15:$D$15,1,MATCH($B$2,Scenari!$B$3:$D$3,0))>INDEX(Scenari!$B$39:$D$39,1,MATCH($B$2,Scenari!$B$3:$D$3,0)),\"Rafforzare appuntamenti\",IF(INDEX(Scenari!$B$20:$D$20,1,MATCH($B$2,Scenari!$B$3:$D$3,0))/INDEX(Scenari!$B$15:$D$15,1,MATCH($B$2,Scenari!$B$3:$D$3,0))>INDEX(Scenari!$B$40:$D$40,1,MATCH($B$2,Scenari!$B$3:$D$3,0)),\"Rafforzare proposte\",IF(INDEX(Scenari!$B$47:$D$47,1,MATCH($B$2,Scenari!$B$3:$D$3,0))>INDEX(Scenari!$B$16:$D$16,1,MATCH($B$2,Scenari!$B$3:$D$3,0)),\"Rafforzare budget / CPL\",\"In linea\"))))","v":"Rafforzare appuntamenti"}]
[6,{"$f":"IF($A12<=INDEX(Scenari!$B$15:$D$15,1,MATCH($B$2,Scenari!$B$3:$D$3,0)),INDEX(Scenari!$B$13:$D$13,1,MATCH($B$2,Scenari!$B$3:$D$3,0))/INDEX(Scenari!$B$15:$D$15,1,MATCH($B$2,Scenari!$B$3:$D$3,0)),\"\")","v":{"v":2,"d":"2.0"}},{"$f":"IF(B12=\"\",\"\",SUM($B$7:B12))","v":{"v":12,"d":"12.0"}},{"$f":"IF($A12<=INDEX(Scenari!$B$15:$D$15,1,MATCH($B$2,Scenari!$B$3:$D$3,0)),INDEX(Scenari!$B$42:$D$42,1,MATCH($B$2,Scenari!$B$3:$D$3,0))/INDEX(Scenari!$B$15:$D$15,1,MATCH($B$2,Scenari!$B$3:$D$3,0)),\"\")","v":{"v":187.0748299319728,"d":"187.1"}},{"$f":"IF($A12<=INDEX(Scenari!$B$15:$D$15,1,MATCH($B$2,Scenari!$B$3:$D$3,0)),INDEX(Scenari!$B$43:$D$43,1,MATCH($B$2,Scenari!$B$3:$D$3,0))/INDEX(Scenari!$B$15:$D$15,1,MATCH($B$2,Scenari!$B$3:$D$3,0)),\"\")","v":{"v":159.0136054421769,"d":"159.0"}},{"$f":"IF($A12<=INDEX(Scenari!$B$15:$D$15,1,MATCH($B$2,Scenari!$B$3:$D$3,0)),INDEX(Scenari!$B$19:$D$19,1,MATCH($B$2,Scenari!$B$3:$D$3,0))/INDEX(Scenari!$B$15:$D$15,1,MATCH($B$2,Scenari!$B$3:$D$3,0)),\"\")","v":{"v":20.408163265306122,"d":"20.4"}},{"$f":"IF($A12<=INDEX(Scenari!$B$15:$D$15,1,MATCH($B$2,Scenari!$B$3:$D$3,0)),INDEX(Scenari!$B$20:$D$20,1,MATCH($B$2,Scenari!$B$3:$D$3,0))/INDEX(Scenari!$B$15:$D$15,1,MATCH($B$2,Scenari!$B$3:$D$3,0)),\"\")","v":{"v":7.142857142857142,"d":"7.1"}},{"$f":"IF($A12<=INDEX(Scenari!$B$15:$D$15,1,MATCH($B$2,Scenari!$B$3:$D$3,0)),INDEX(Scenari!$B$47:$D$47,1,MATCH($B$2,Scenari!$B$3:$D$3,0)),\"\")","v":6646.768707482995},{"$f":"IF(B12=\"\",\"\",IF(INDEX(Scenari!$B$19:$D$19,1,MATCH($B$2,Scenari!$B$3:$D$3,0))/INDEX(Scenari!$B$15:$D$15,1,MATCH($B$2,Scenari!$B$3:$D$3,0))>INDEX(Scenari!$B$39:$D$39,1,MATCH($B$2,Scenari!$B$3:$D$3,0)),\"Rafforzare appuntamenti\",IF(INDEX(Scenari!$B$20:$D$20,1,MATCH($B$2,Scenari!$B$3:$D$3,0))/INDEX(Scenari!$B$15:$D$15,1,MATCH($B$2,Scenari!$B$3:$D$3,0))>INDEX(Scenari!$B$40:$D$40,1,MATCH($B$2,Scenari!$B$3:$D$3,0)),\"Rafforzare proposte\",IF(INDEX(Scenari!$B$47:$D$47,1,MATCH($B$2,Scenari!$B$3:$D$3,0))>INDEX(Scenari!$B$16:$D$16,1,MATCH($B$2,Scenari!$B$3:$D$3,0)),\"Rafforzare budget / CPL\",\"In linea\"))))","v":"Rafforzare appuntamenti"}]
[7,{"$f":"IF($A13<=INDEX(Scenari!$B$15:$D$15,1,MATCH($B$2,Scenari!$B$3:$D$3,0)),INDEX(Scenari!$B$13:$D$13,1,MATCH($B$2,Scenari!$B$3:$D$3,0))/INDEX(Scenari!$B$15:$D$15,1,MATCH($B$2,Scenari!$B$3:$D$3,0)),\"\")","v":{"v":2,"d":"2.0"}},{"$f":"IF(B13=\"\",\"\",SUM($B$7:B13))","v":{"v":14,"d":"14.0"}},{"$f":"IF($A13<=INDEX(Scenari!$B$15:$D$15,1,MATCH($B$2,Scenari!$B$3:$D$3,0)),INDEX(Scenari!$B$42:$D$42,1,MATCH($B$2,Scenari!$B$3:$D$3,0))/INDEX(Scenari!$B$15:$D$15,1,MATCH($B$2,Scenari!$B$3:$D$3,0)),\"\")","v":{"v":187.0748299319728,"d":"187.1"}},{"$f":"IF($A13<=INDEX(Scenari!$B$15:$D$15,1,MATCH($B$2,Scenari!$B$3:$D$3,0)),INDEX(Scenari!$B$43:$D$43,1,MATCH($B$2,Scenari!$B$3:$D$3,0))/INDEX(Scenari!$B$15:$D$15,1,MATCH($B$2,Scenari!$B$3:$D$3,0)),\"\")","v":{"v":159.0136054421769,"d":"159.0"}},{"$f":"IF($A13<=INDEX(Scenari!$B$15:$D$15,1,MATCH($B$2,Scenari!$B$3:$D$3,0)),INDEX(Scenari!$B$19:$D$19,1,MATCH($B$2,Scenari!$B$3:$D$3,0))/INDEX(Scenari!$B$15:$D$15,1,MATCH($B$2,Scenari!$B$3:$D$3,0)),\"\")","v":{"v":20.408163265306122,"d":"20.4"}},{"$f":"IF($A13<=INDEX(Scenari!$B$15:$D$15,1,MATCH($B$2,Scenari!$B$3:$D$3,0)),INDEX(Scenari!$B$20:$D$20,1,MATCH($B$2,Scenari!$B$3:$D$3,0))/INDEX(Scenari!$B$15:$D$15,1,MATCH($B$2,Scenari!$B$3:$D$3,0)),\"\")","v":{"v":7.142857142857142,"d":"7.1"}},{"$f":"IF($A13<=INDEX(Scenari!$B$15:$D$15,1,MATCH($B$2,Scenari!$B$3:$D$3,0)),INDEX(Scenari!$B$47:$D$47,1,MATCH($B$2,Scenari!$B$3:$D$3,0)),\"\")","v":6646.768707482995},{"$f":"IF(B13=\"\",\"\",IF(INDEX(Scenari!$B$19:$D$19,1,MATCH($B$2,Scenari!$B$3:$D$3,0))/INDEX(Scenari!$B$15:$D$15,1,MATCH($B$2,Scenari!$B$3:$D$3,0))>INDEX(Scenari!$B$39:$D$39,1,MATCH($B$2,Scenari!$B$3:$D$3,0)),\"Rafforzare appuntamenti\",IF(INDEX(Scenari!$B$20:$D$20,1,MATCH($B$2,Scenari!$B$3:$D$3,0))/INDEX(Scenari!$B$15:$D$15,1,MATCH($B$2,Scenari!$B$3:$D$3,0))>INDEX(Scenari!$B$40:$D$40,1,MATCH($B$2,Scenari!$B$3:$D$3,0)),\"Rafforzare proposte\",IF(INDEX(Scenari!$B$47:$D$47,1,MATCH($B$2,Scenari!$B$3:$D$3,0))>INDEX(Scenari!$B$16:$D$16,1,MATCH($B$2,Scenari!$B$3:$D$3,0)),\"Rafforzare budget / CPL\",\"In linea\"))))","v":"Rafforzare appuntamenti"}]
[8,{"$f":"IF($A14<=INDEX(Scenari!$B$15:$D$15,1,MATCH($B$2,Scenari!$B$3:$D$3,0)),INDEX(Scenari!$B$13:$D$13,1,MATCH($B$2,Scenari!$B$3:$D$3,0))/INDEX(Scenari!$B$15:$D$15,1,MATCH($B$2,Scenari!$B$3:$D$3,0)),\"\")","v":{"v":2,"d":"2.0"}},{"$f":"IF(B14=\"\",\"\",SUM($B$7:B14))","v":{"v":16,"d":"16.0"}},{"$f":"IF($A14<=INDEX(Scenari!$B$15:$D$15,1,MATCH($B$2,Scenari!$B$3:$D$3,0)),INDEX(Scenari!$B$42:$D$42,1,MATCH($B$2,Scenari!$B$3:$D$3,0))/INDEX(Scenari!$B$15:$D$15,1,MATCH($B$2,Scenari!$B$3:$D$3,0)),\"\")","v":{"v":187.0748299319728,"d":"187.1"}},{"$f":"IF($A14<=INDEX(Scenari!$B$15:$D$15,1,MATCH($B$2,Scenari!$B$3:$D$3,0)),INDEX(Scenari!$B$43:$D$43,1,MATCH($B$2,Scenari!$B$3:$D$3,0))/INDEX(Scenari!$B$15:$D$15,1,MATCH($B$2,Scenari!$B$3:$D$3,0)),\"\")","v":{"v":159.0136054421769,"d":"159.0"}},{"$f":"IF($A14<=INDEX(Scenari!$B$15:$D$15,1,MATCH($B$2,Scenari!$B$3:$D$3,0)),INDEX(Scenari!$B$19:$D$19,1,MATCH($B$2,Scenari!$B$3:$D$3,0))/INDEX(Scenari!$B$15:$D$15,1,MATCH($B$2,Scenari!$B$3:$D$3,0)),\"\")","v":{"v":20.408163265306122,"d":"20.4"}},{"$f":"IF($A14<=INDEX(Scenari!$B$15:$D$15,1,MATCH($B$2,Scenari!$B$3:$D$3,0)),INDEX(Scenari!$B$20:$D$20,1,MATCH($B$2,Scenari!$B$3:$D$3,0))/INDEX(Scenari!$B$15:$D$15,1,MATCH($B$2,Scenari!$B$3:$D$3,0)),\"\")","v":{"v":7.142857142857142,"d":"7.1"}},{"$f":"IF($A14<=INDEX(Scenari!$B$15:$D$15,1,MATCH($B$2,Scenari!$B$3:$D$3,0)),INDEX(Scenari!$B$47:$D$47,1,MATCH($B$2,Scenari!$B$3:$D$3,0)),\"\")","v":6646.768707482995},{"$f":"IF(B14=\"\",\"\",IF(INDEX(Scenari!$B$19:$D$19,1,MATCH($B$2,Scenari!$B$3:$D$3,0))/INDEX(Scenari!$B$15:$D$15,1,MATCH($B$2,Scenari!$B$3:$D$3,0))>INDEX(Scenari!$B$39:$D$39,1,MATCH($B$2,Scenari!$B$3:$D$3,0)),\"Rafforzare appuntamenti\",IF(INDEX(Scenari!$B$20:$D$20,1,MATCH($B$2,Scenari!$B$3:$D$3,0))/INDEX(Scenari!$B$15:$D$15,1,MATCH($B$2,Scenari!$B$3:$D$3,0))>INDEX(Scenari!$B$40:$D$40,1,MATCH($B$2,Scenari!$B$3:$D$3,0)),\"Rafforzare proposte\",IF(INDEX(Scenari!$B$47:$D$47,1,MATCH($B$2,Scenari!$B$3:$D$3,0))>INDEX(Scenari!$B$16:$D$16,1,MATCH($B$2,Scenari!$B$3:$D$3,0)),\"Rafforzare budget / CPL\",\"In linea\"))))","v":"Rafforzare appuntamenti"}]
[9,{"$f":"IF($A15<=INDEX(Scenari!$B$15:$D$15,1,MATCH($B$2,Scenari!$B$3:$D$3,0)),INDEX(Scenari!$B$13:$D$13,1,MATCH($B$2,Scenari!$B$3:$D$3,0))/INDEX(Scenari!$B$15:$D$15,1,MATCH($B$2,Scenari!$B$3:$D$3,0)),\"\")","v":{"v":2,"d":"2.0"}},{"$f":"IF(B15=\"\",\"\",SUM($B$7:B15))","v":{"v":18,"d":"18.0"}},{"$f":"IF($A15<=INDEX(Scenari!$B$15:$D$15,1,MATCH($B$2,Scenari!$B$3:$D$3,0)),INDEX(Scenari!$B$42:$D$42,1,MATCH($B$2,Scenari!$B$3:$D$3,0))/INDEX(Scenari!$B$15:$D$15,1,MATCH($B$2,Scenari!$B$3:$D$3,0)),\"\")","v":{"v":187.0748299319728,"d":"187.1"}},{"$f":"IF($A15<=INDEX(Scenari!$B$15:$D$15,1,MATCH($B$2,Scenari!$B$3:$D$3,0)),INDEX(Scenari!$B$43:$D$43,1,MATCH($B$2,Scenari!$B$3:$D$3,0))/INDEX(Scenari!$B$15:$D$15,1,MATCH($B$2,Scenari!$B$3:$D$3,0)),\"\")","v":{"v":159.0136054421769,"d":"159.0"}},{"$f":"IF($A15<=INDEX(Scenari!$B$15:$D$15,1,MATCH($B$2,Scenari!$B$3:$D$3,0)),INDEX(Scenari!$B$19:$D$19,1,MATCH($B$2,Scenari!$B$3:$D$3,0))/INDEX(Scenari!$B$15:$D$15,1,MATCH($B$2,Scenari!$B$3:$D$3,0)),\"\")","v":{"v":20.408163265306122,"d":"20.4"}},{"$f":"IF($A15<=INDEX(Scenari!$B$15:$D$15,1,MATCH($B$2,Scenari!$B$3:$D$3,0)),INDEX(Scenari!$B$20:$D$20,1,MATCH($B$2,Scenari!$B$3:$D$3,0))/INDEX(Scenari!$B$15:$D$15,1,MATCH($B$2,Scenari!$B$3:$D$3,0)),\"\")","v":{"v":7.142857142857142,"d":"7.1"}},{"$f":"IF($A15<=INDEX(Scenari!$B$15:$D$15,1,MATCH($B$2,Scenari!$B$3:$D$3,0)),INDEX(Scenari!$B$47:$D$47,1,MATCH($B$2,Scenari!$B$3:$D$3,0)),\"\")","v":6646.768707482995},{"$f":"IF(B15=\"\",\"\",IF(INDEX(Scenari!$B$19:$D$19,1,MATCH($B$2,Scenari!$B$3:$D$3,0))/INDEX(Scenari!$B$15:$D$15,1,MATCH($B$2,Scenari!$B$3:$D$3,0))>INDEX(Scenari!$B$39:$D$39,1,MATCH($B$2,Scenari!$B$3:$D$3,0)),\"Rafforzare appuntamenti\",IF(INDEX(Scenari!$B$20:$D$20,1,MATCH($B$2,Scenari!$B$3:$D$3,0))/INDEX(Scenari!$B$15:$D$15,1,MATCH($B$2,Scenari!$B$3:$D$3,0))>INDEX(Scenari!$B$40:$D$40,1,MATCH($B$2,Scenari!$B$3:$D$3,0)),\"Rafforzare proposte\",IF(INDEX(Scenari!$B$47:$D$47,1,MATCH($B$2,Scenari!$B$3:$D$3,0))>INDEX(Scenari!$B$16:$D$16,1,MATCH($B$2,Scenari!$B$3:$D$3,0)),\"Rafforzare budget / CPL\",\"In linea\"))))","v":"Rafforzare appuntamenti"}]
{"$rows_left_out":19}